{"text_format":"1","workbook":"xlsx","n_sheets":5,"sheets":["2025 GOLF Only Fall Solutions","SUMMARY - UNITS","REBATE MATRIX (NOW)","2025 NOW_EOP_LL","Sheet4"],"not_rendered":{"charts":0,"images":2,"macros":1,"external_links":1,"defined_names":20,"comments":3,"pivot_tables":1},"unopened":[],"bounds":{"document_bytes":16777216,"sheet_cells":100000,"rows_first":2000,"rows_last":500,"rows_between":2000,"halvings":0,"cell_chars":16384,"cell_head_chars":4096},"cells_cut":0,"cells_raw":0,"read":"whole","date_system":"1900"}

{"sheet":"2025 GOLF Only Fall Solutions","index":0,"n_rows":108,"n_cols":31,"rows_kept":108,"cut":false,"hidden":false,"merged":[[6,18,7,18],[6,17,7,17],[94,5,94,7],[95,5,95,7],[6,10,7,12],[8,10,8,12],[6,13,7,13],[11,25,13,25],[11,22,13,22],[11,23,13,23],[11,24,13,24],[93,12,99,23],[11,18,13,18],[11,0,13,0],[11,14,13,14],[11,16,13,16],[11,3,13,3],[11,12,13,12],[11,13,13,13],[11,8,13,8],[0,6,0,13],[11,17,13,17],[11,15,13,15],[11,5,13,5],[11,6,13,6],[11,7,13,7],[11,9,13,9],[11,10,13,10],[11,11,13,11],[3,5,3,6],[107,5,107,9],[105,5,105,7],[105,8,105,9],[100,5,100,7],[102,5,102,7],[103,5,103,7],[101,5,101,7],[100,12,104,23],[11,1,13,1],[11,2,13,2],[6,9,7,9],[11,19,13,19],[11,20,13,20],[11,21,13,21],[104,5,104,7],[98,5,98,7],[99,5,99,7],[94,8,94,9],[93,5,93,7],[93,8,93,9],[97,5,97,7],[96,5,96,7],[91,5,91,9]]}
[null,null,null,null,null,null,"Golf National 2025 Fall Solutions Calculator               "]
[]
[null,null,null,null,null,null,null,null,null,null,"Additional Rebates & Bonus Unlocks:"]
[null,null,null,null,null,"NAME YOUR DRAFT ORDER HERE:",null,null,null,"Spend Requirement:","$5k+",null,"$20k+","$50k+",null,null,null,"$100k+","$150k+"]
[null,null,null,null,null,"Description: ",null,null,null,"Tier Rebate:",0.02,null,0.03,0.04,null,null,null,0.05,0.06,null,null,null,null,null,null,null,null,null,"Tier Rebate Less Ronstar & Specticle Flo"]
[null,null,null,null,null,"Dist/DSR: ",null,null,null,null,{"$f":"AND($N$62+$O$88>=5000,$N$62+$O$88<20000)","v":false},null,{"$f":"AND($N$62+$O$88>=20000,$N$62+$O$88<50000)","v":false},{"$f":"AND($N$62+$O$88>=50000,$N$62+$O$88<100000)","v":false},null,null,null,{"$f":"AND($N$62+$O$88>=100000,$N$62+$O$88<150000)","v":false},{"$f":"AND($N$62+$O$88>=150000)","v":false}]
[null,null,null,null,null,"MER#: ",null,null,null,"Product:","Stressgard &Chipco Sig.\n(>$10k)",null,null,"Serata\n(8 unit min.)",null,null,null,"Durentis\n(4+ 64 oz units or\n16+ 16oz units)","Volume Buy\n(5 or more products)"]
[null,null,null,null,null,"Last Updated: "]
{"$rows_left_out":101}
{"sheet":"SUMMARY - UNITS","index":1,"n_rows":112,"n_cols":12,"rows_kept":112,"cut":false,"hidden":false,"merged":[[103,3,110,11],[99,8,99,9],[101,3,101,9],[111,3,113,11],[99,3,99,7],[98,3,98,7],[85,3,86,11],[8,9,10,9],[8,11,10,11],[90,3,90,6],[88,8,88,9],[8,10,10,10],[92,3,92,7],[97,3,97,7],[96,3,96,7],[94,3,94,7],[89,3,89,7],[88,3,88,7],[87,3,87,7],[87,8,87,9],[8,5,10,5],[95,3,95,7],[1,3,1,8],[2,4,2,8],[3,4,3,8],[4,4,4,8],[5,4,5,8],[93,3,93,7],[6,4,6,8],[8,3,10,3],[8,4,10,4],[8,6,10,6],[8,8,10,8],[8,7,10,7],[91,3,91,7]]}
[]
[null,null,null,{"$f":"'2025 GOLF Only Fall Solutions'!F4","v":"NAME YOUR DRAFT ORDER HERE:"}]
[null,null,null,"Description: ",{"$f":"IF('2025 GOLF Only Fall Solutions'!G5=\"\",\"\",'2025 GOLF Only Fall Solutions'!G5)","v":""}]
[null,null,null,"Distributor/DSR: ",{"$f":"IF('2025 GOLF Only Fall Solutions'!G6=\"\",\"\",'2025 GOLF Only Fall Solutions'!G6)","v":""}]
[null,null,null,"MER#: ",{"$f":"IF('2025 GOLF Only Fall Solutions'!G7=\"\",\"\",'2025 GOLF Only Fall Solutions'!G7)","v":""}]
[null,null,null,"Last Updated: ",{"$f":"IF('2025 GOLF Only Fall Solutions'!G8=\"\",\"\",'2025 GOLF Only Fall Solutions'!G8)","v":""}]
[null,null,null,"Created For: ",{"$f":"IF('2025 GOLF Only Fall Solutions'!G9=\"\",\"\",'2025 GOLF Only Fall Solutions'!G9)","v":""}]
[null,null,null,"Page 1 of 1"]
{"$rows_left_out":105}
{"sheet":"REBATE MATRIX (NOW)","index":2,"n_rows":70,"n_cols":19,"rows_kept":70,"cut":false,"hidden":true,"merged":[]}
[null,null,null,null,null,null,null,null,null,null,null,null,null,null,null,null,{"$f":"COUNTIF(Rebate_Lookup[Volume Buy Counter],TRUE)","v":19}]
[null,"SKU CODE","Agency/TT","Description","Size","Type","Instances","MOQ_1","MOQ_2","MOQ_3","REB_MOQ_1","REB_MOQ_2","REB_MOQ_3","Order Form Quantity","Qualified Rebate Tier","Column1","Volume Buy Counter"]
[null,"D00000903",{"$f":"INDEX(PRICING[Agency/TT],MATCH(Rebate_Lookup[[#This Row],[SKU CODE]],PRICING[SKU],0))","v":"A"},{"$f":"INDEX(PRICING[Product],MATCH(B3,PRICING[SKU],0))","v":"Altus®"},{"$f":"INDEX(PRICING[Size],MATCH(Rebate_Lookup[[#This Row],[SKU CODE]],PRICING[SKU],0))","v":"64 oz"},{"$f":"INDEX(PRICING[Indication],MATCH(Rebate_Lookup[[#This Row],[SKU CODE]],PRICING[SKU],0))","v":"I"},{"$f":"COUNTIFS(PRICING[SKU],B3)","v":3},null,null,null,null,{"$f":"SUMIFS(PRICING[Rebate $],PRICING[Program],\"NOW\",PRICING[SKU],Rebate_Lookup[[#This Row],[SKU CODE]],PRICING[Set],2)","v":0},{"$f":"SUMIFS(PRICING[Rebate $],PRICING[Program],\"NOW\",PRICING[SKU],Rebate_Lookup[[#This Row],[SKU CODE]],PRICING[Set],3)","v":0},{"$f":"INDEX('2025 GOLF Only Fall Solutions'!J:J,MATCH(Rebate_Lookup[[#This Row],[SKU CODE]],'2025 GOLF Only Fall Solutions'!A:A,0))","v":0},{"$f":"IF(Rebate_Lookup[[#This Row],[Instances]]=1,1,\nIF(AND(Rebate_Lookup[[#This Row],[Instances]]=2,Rebate_Lookup[[#This Row],[Order Form Quantity]]<Rebate_Lookup[[#This Row],[MOQ_2]]),1,IF(AND(Rebate_Lookup[[#This Row],[Instances]]=2,Rebate_Lookup[[#This Row],[Order Form Quantity]]>=Rebate_Lookup[[#This Row],[MOQ_2]]),2,\nIF(AND(Rebate_Lookup[[#This Row],[Instances]]=3,Rebate_Lookup[[#This Row],[Order Form Quantity]]<Rebate_Lookup[[#This Row],[MOQ_2]]),1,IF(AND(Rebate_Lookup[[#This Row],[Instances]]=3,Rebate_Lookup[[#This Row],[MOQ_2]]<=Rebate_Lookup[[#This Row],[Order Form Quantity]],Rebate_Lookup[[#This Row],[Order Form Quantity]]<Rebate_Lookup[[#This Row],[MOQ_3]]),2,IF(AND(Rebate_Lookup[[#This Row],[Instances]]=3,Rebate_Lookup[[#This Row],[Order Form Quantity]]>=Rebate_Lookup[[#This Row],[MOQ_3]]),3))))))","v":3},{"$f":"COUNTIF('2025 GOLF Only Fall Solutions'!A:A,Rebate_Lookup[[#This Row],[SKU CODE]])","v":3},{"$f":"IFERROR(Rebate_Lookup[[#This Row],[Order Form Quantity]]>=Rebate_Lookup[[#This Row],[MOQ_2]],0)","v":true}]
[null,"D00000907",{"$f":"INDEX(PRICING[Agency/TT],MATCH(Rebate_Lookup[[#This Row],[SKU CODE]],PRICING[SKU],0))","v":"A"},{"$f":"INDEX(PRICING[Product],MATCH(B4,PRICING[SKU],0))","v":"Banol®"},{"$f":"INDEX(PRICING[Size],MATCH(Rebate_Lookup[[#This Row],[SKU CODE]],PRICING[SKU],0))","v":"2.5 gal "},{"$f":"INDEX(PRICING[Indication],MATCH(Rebate_Lookup[[#This Row],[SKU CODE]],PRICING[SKU],0))","v":"F"},{"$f":"COUNTIFS(PRICING[SKU],B4)","v":2},0,2,null,{"$f":"SUMIFS(PRICING[Rebate $],PRICING[SKU],Rebate_Lookup[[#This Row],[SKU CODE]],PRICING[Set],1)","v":0},{"$f":"SUMIFS(PRICING[Rebate $],PRICING[SKU],Rebate_Lookup[[#This Row],[SKU CODE]],PRICING[Set],2)","v":90},{"$f":"SUMIFS(PRICING[Rebate $],PRICING[SKU],Rebate_Lookup[[#This Row],[SKU CODE]],PRICING[Set],3)","v":0},{"$f":"INDEX('2025 GOLF Only Fall Solutions'!J:J,MATCH(Rebate_Lookup[[#This Row],[SKU CODE]],'2025 GOLF Only Fall Solutions'!A:A,0))","v":0},{"$f":"IF(Rebate_Lookup[[#This Row],[Instances]]=1,1,\nIF(AND(Rebate_Lookup[[#This Row],[Instances]]=2,Rebate_Lookup[[#This Row],[Order Form Quantity]]<Rebate_Lookup[[#This Row],[MOQ_2]]),1,IF(AND(Rebate_Lookup[[#This Row],[Instances]]=2,Rebate_Lookup[[#This Row],[Order Form Quantity]]>=Rebate_Lookup[[#This Row],[MOQ_2]]),2,\nIF(AND(Rebate_Lookup[[#This Row],[Instances]]=3,Rebate_Lookup[[#This Row],[Order Form Quantity]]<Rebate_Lookup[[#This Row],[MOQ_2]]),1,IF(AND(Rebate_Lookup[[#This Row],[Instances]]=3,Rebate_Lookup[[#This Row],[MOQ_2]]<=Rebate_Lookup[[#This Row],[Order Form Quantity]],Rebate_Lookup[[#This Row],[Order Form Quantity]]<Rebate_Lookup[[#This Row],[MOQ_3]]),2,IF(AND(Rebate_Lookup[[#This Row],[Instances]]=3,Rebate_Lookup[[#This Row],[Order Form Quantity]]>=Rebate_Lookup[[#This Row],[MOQ_3]]),3))))))","v":1},{"$f":"COUNTIF('2025 GOLF Only Fall Solutions'!A:A,Rebate_Lookup[[#This Row],[SKU CODE]])","v":1},{"$f":"IFERROR(Rebate_Lookup[[#This Row],[Order Form Quantity]]>=Rebate_Lookup[[#This Row],[MOQ_2]],0)","v":false},null,{"$f":"COUNTIF('2025 GOLF Only Fall Solutions'!A:A,Rebate_Lookup[[#This Row],[SKU CODE]])","v":1}]
[null,"D00000623",{"$f":"INDEX(PRICING[Agency/TT],MATCH(Rebate_Lookup[[#This Row],[SKU CODE]],PRICING[SKU],0))","v":"A"},{"$f":"INDEX(PRICING[Product],MATCH(B5,PRICING[SKU],0))","v":"Castlon™"},{"$f":"INDEX(PRICING[Size],MATCH(Rebate_Lookup[[#This Row],[SKU CODE]],PRICING[SKU],0))","v":"1 gal"},{"$f":"INDEX(PRICING[Indication],MATCH(Rebate_Lookup[[#This Row],[SKU CODE]],PRICING[SKU],0))","v":"F"},{"$f":"COUNTIFS(PRICING[SKU],B5)","v":3},0,5,10,{"$f":"SUMIFS(PRICING[Rebate $],PRICING[SKU],Rebate_Lookup[[#This Row],[SKU CODE]],PRICING[Set],1)","v":0},{"$f":"SUMIFS(PRICING[Rebate $],PRICING[SKU],Rebate_Lookup[[#This Row],[SKU CODE]],PRICING[Set],2)","v":525},{"$f":"SUMIFS(PRICING[Rebate $],PRICING[SKU],Rebate_Lookup[[#This Row],[SKU CODE]],PRICING[Set],3)","v":585},{"$f":"INDEX('2025 GOLF Only Fall Solutions'!J:J,MATCH(Rebate_Lookup[[#This Row],[SKU CODE]],'2025 GOLF Only Fall Solutions'!A:A,0))","v":0},{"$f":"IF(Rebate_Lookup[[#This Row],[Instances]]=1,1,\nIF(AND(Rebate_Lookup[[#This Row],[Instances]]=2,Rebate_Lookup[[#This Row],[Order Form Quantity]]<Rebate_Lookup[[#This Row],[MOQ_2]]),1,IF(AND(Rebate_Lookup[[#This Row],[Instances]]=2,Rebate_Lookup[[#This Row],[Order Form Quantity]]>=Rebate_Lookup[[#This Row],[MOQ_2]]),2,\nIF(AND(Rebate_Lookup[[#This Row],[Instances]]=3,Rebate_Lookup[[#This Row],[Order Form Quantity]]<Rebate_Lookup[[#This Row],[MOQ_2]]),1,IF(AND(Rebate_Lookup[[#This Row],[Instances]]=3,Rebate_Lookup[[#This Row],[MOQ_2]]<=Rebate_Lookup[[#This Row],[Order Form Quantity]],Rebate_Lookup[[#This Row],[Order Form Quantity]]<Rebate_Lookup[[#This Row],[MOQ_3]]),2,IF(AND(Rebate_Lookup[[#This Row],[Instances]]=3,Rebate_Lookup[[#This Row],[Order Form Quantity]]>=Rebate_Lookup[[#This Row],[MOQ_3]]),3))))))","v":1},{"$f":"COUNTIF('2025 GOLF Only Fall Solutions'!A:A,Rebate_Lookup[[#This Row],[SKU CODE]])","v":1},{"$f":"IFERROR(Rebate_Lookup[[#This Row],[Order Form Quantity]]>=Rebate_Lookup[[#This Row],[MOQ_2]],0)","v":false},null,{"$f":"COUNTIF('2025 GOLF Only Fall Solutions'!A:A,Rebate_Lookup[[#This Row],[SKU CODE]])","v":1}]
[null,"D00000624",{"$f":"INDEX(PRICING[Agency/TT],MATCH(Rebate_Lookup[[#This Row],[SKU CODE]],PRICING[SKU],0))","v":"A"},{"$f":"INDEX(PRICING[Product],MATCH(B6,PRICING[SKU],0))","v":"Castlon™"},{"$f":"INDEX(PRICING[Size],MATCH(Rebate_Lookup[[#This Row],[SKU CODE]],PRICING[SKU],0))","v":"16 oz"},{"$f":"INDEX(PRICING[Indication],MATCH(Rebate_Lookup[[#This Row],[SKU CODE]],PRICING[SKU],0))","v":"F"},{"$f":"COUNTIFS(PRICING[SKU],B6)","v":2},0,4,null,{"$f":"SUMIFS(PRICING[Rebate $],PRICING[SKU],Rebate_Lookup[[#This Row],[SKU CODE]],PRICING[Set],1)","v":0},{"$f":"SUMIFS(PRICING[Rebate $],PRICING[SKU],Rebate_Lookup[[#This Row],[SKU CODE]],PRICING[Set],2)","v":50},{"$f":"SUMIFS(PRICING[Rebate $],PRICING[SKU],Rebate_Lookup[[#This Row],[SKU CODE]],PRICING[Set],3)","v":0},{"$f":"INDEX('2025 GOLF Only Fall Solutions'!J:J,MATCH(Rebate_Lookup[[#This Row],[SKU CODE]],'2025 GOLF Only Fall Solutions'!A:A,0))","v":0},{"$f":"IF(Rebate_Lookup[[#This Row],[Instances]]=1,1,\nIF(AND(Rebate_Lookup[[#This Row],[Instances]]=2,Rebate_Lookup[[#This Row],[Order Form Quantity]]<Rebate_Lookup[[#This Row],[MOQ_2]]),1,IF(AND(Rebate_Lookup[[#This Row],[Instances]]=2,Rebate_Lookup[[#This Row],[Order Form Quantity]]>=Rebate_Lookup[[#This Row],[MOQ_2]]),2,\nIF(AND(Rebate_Lookup[[#This Row],[Instances]]=3,Rebate_Lookup[[#This Row],[Order Form Quantity]]<Rebate_Lookup[[#This Row],[MOQ_2]]),1,IF(AND(Rebate_Lookup[[#This Row],[Instances]]=3,Rebate_Lookup[[#This Row],[MOQ_2]]<=Rebate_Lookup[[#This Row],[Order Form Quantity]],Rebate_Lookup[[#This Row],[Order Form Quantity]]<Rebate_Lookup[[#This Row],[MOQ_3]]),2,IF(AND(Rebate_Lookup[[#This Row],[Instances]]=3,Rebate_Lookup[[#This Row],[Order Form Quantity]]>=Rebate_Lookup[[#This Row],[MOQ_3]]),3))))))","v":1},{"$f":"COUNTIF('2025 GOLF Only Fall Solutions'!A:A,Rebate_Lookup[[#This Row],[SKU CODE]])","v":1},{"$f":"IFERROR(Rebate_Lookup[[#This Row],[Order Form Quantity]]>=Rebate_Lookup[[#This Row],[MOQ_2]],0)","v":false},null,{"$f":"COUNTIF('2025 GOLF Only Fall Solutions'!A:A,Rebate_Lookup[[#This Row],[SKU CODE]])","v":1}]
[null,79714858,{"$f":"INDEX(PRICING[Agency/TT],MATCH(Rebate_Lookup[[#This Row],[SKU CODE]],PRICING[SKU],0))","v":"A"},{"$f":"INDEX(PRICING[Product],MATCH(B7,PRICING[SKU],0))","v":"Celsius® WG"},{"$f":"INDEX(PRICING[Size],MATCH(Rebate_Lookup[[#This Row],[SKU CODE]],PRICING[SKU],0))","v":"10 oz"},{"$f":"INDEX(PRICING[Indication],MATCH(Rebate_Lookup[[#This Row],[SKU CODE]],PRICING[SKU],0))","v":"H"},{"$f":"COUNTIFS(PRICING[SKU],B7)","v":2},0,48,null,{"$f":"SUMIFS(PRICING[Rebate $],PRICING[SKU],Rebate_Lookup[[#This Row],[SKU CODE]],PRICING[Set],1)","v":0},12,{"$f":"SUMIFS(PRICING[Rebate $],PRICING[SKU],Rebate_Lookup[[#This Row],[SKU CODE]],PRICING[Set],3)","v":0},{"$f":"INDEX('2025 GOLF Only Fall Solutions'!J:J,MATCH(Rebate_Lookup[[#This Row],[SKU CODE]],'2025 GOLF Only Fall Solutions'!A:A,0))","v":0},{"$f":"IF(Rebate_Lookup[[#This Row],[Instances]]=1,1,\nIF(AND(Rebate_Lookup[[#This Row],[Instances]]=2,Rebate_Lookup[[#This Row],[Order Form Quantity]]<Rebate_Lookup[[#This Row],[MOQ_2]]),1,IF(AND(Rebate_Lookup[[#This Row],[Instances]]=2,Rebate_Lookup[[#This Row],[Order Form Quantity]]>=Rebate_Lookup[[#This Row],[MOQ_2]]),2,\nIF(AND(Rebate_Lookup[[#This Row],[Instances]]=3,Rebate_Lookup[[#This Row],[Order Form Quantity]]<Rebate_Lookup[[#This Row],[MOQ_2]]),1,IF(AND(Rebate_Lookup[[#This Row],[Instances]]=3,Rebate_Lookup[[#This Row],[MOQ_2]]<=Rebate_Lookup[[#This Row],[Order Form Quantity]],Rebate_Lookup[[#This Row],[Order Form Quantity]]<Rebate_Lookup[[#This Row],[MOQ_3]]),2,IF(AND(Rebate_Lookup[[#This Row],[Instances]]=3,Rebate_Lookup[[#This Row],[Order Form Quantity]]>=Rebate_Lookup[[#This Row],[MOQ_3]]),3))))))","v":1},{"$f":"COUNTIF('2025 GOLF Only Fall Solutions'!A:A,Rebate_Lookup[[#This Row],[SKU CODE]])","v":1},{"$f":"IFERROR(Rebate_Lookup[[#This Row],[Order Form Quantity]]>=Rebate_Lookup[[#This Row],[MOQ_2]],0)","v":false},null,{"$f":"COUNTIF('2025 GOLF Only Fall Solutions'!A:A,Rebate_Lookup[[#This Row],[SKU CODE]])","v":1}]
[null,"D00000911",{"$f":"INDEX(PRICING[Agency/TT],MATCH(Rebate_Lookup[[#This Row],[SKU CODE]],PRICING[SKU],0))","v":"A"},{"$f":"INDEX(PRICING[Product],MATCH(B8,PRICING[SKU],0))","v":"Celsius® XTRA"},{"$f":"INDEX(PRICING[Size],MATCH(Rebate_Lookup[[#This Row],[SKU CODE]],PRICING[SKU],0))","v":"10 oz"},{"$f":"INDEX(PRICING[Indication],MATCH(Rebate_Lookup[[#This Row],[SKU CODE]],PRICING[SKU],0))","v":"H"},{"$f":"COUNTIFS(PRICING[SKU],B8)","v":2},0,16,null,{"$f":"SUMIFS(PRICING[Rebate $],PRICING[SKU],Rebate_Lookup[[#This Row],[SKU CODE]],PRICING[Set],1)","v":0},{"$f":"SUMIFS(PRICING[Rebate $],PRICING[SKU],Rebate_Lookup[[#This Row],[SKU CODE]],PRICING[Set],2)","v":12},{"$f":"SUMIFS(PRICING[Rebate $],PRICING[SKU],Rebate_Lookup[[#This Row],[SKU CODE]],PRICING[Set],3)","v":0},{"$f":"INDEX('2025 GOLF Only Fall Solutions'!J:J,MATCH(Rebate_Lookup[[#This Row],[SKU CODE]],'2025 GOLF Only Fall Solutions'!A:A,0))","v":0},{"$f":"IF(Rebate_Lookup[[#This Row],[Instances]]=1,1,\nIF(AND(Rebate_Lookup[[#This Row],[Instances]]=2,Rebate_Lookup[[#This Row],[Order Form Quantity]]<Rebate_Lookup[[#This Row],[MOQ_2]]),1,IF(AND(Rebate_Lookup[[#This Row],[Instances]]=2,Rebate_Lookup[[#This Row],[Order Form Quantity]]>=Rebate_Lookup[[#This Row],[MOQ_2]]),2,\nIF(AND(Rebate_Lookup[[#This Row],[Instances]]=3,Rebate_Lookup[[#This Row],[Order Form Quantity]]<Rebate_Lookup[[#This Row],[MOQ_2]]),1,IF(AND(Rebate_Lookup[[#This Row],[Instances]]=3,Rebate_Lookup[[#This Row],[MOQ_2]]<=Rebate_Lookup[[#This Row],[Order Form Quantity]],Rebate_Lookup[[#This Row],[Order Form Quantity]]<Rebate_Lookup[[#This Row],[MOQ_3]]),2,IF(AND(Rebate_Lookup[[#This Row],[Instances]]=3,Rebate_Lookup[[#This Row],[Order Form Quantity]]>=Rebate_Lookup[[#This Row],[MOQ_3]]),3))))))","v":1},{"$f":"COUNTIF('2025 GOLF Only Fall Solutions'!A:A,Rebate_Lookup[[#This Row],[SKU CODE]])","v":1},{"$f":"IFERROR(Rebate_Lookup[[#This Row],[Order Form Quantity]]>=Rebate_Lookup[[#This Row],[MOQ_2]],0)","v":false},null,{"$f":"COUNTIF('2025 GOLF Only Fall Solutions'!A:A,Rebate_Lookup[[#This Row],[SKU CODE]])","v":1}]
{"$rows_left_out":63}
{"sheet":"2025 NOW_EOP_LL","index":3,"n_rows":129,"n_cols":38,"rows_kept":129,"cut":false,"hidden":true,"merged":[]}
["Manufacturer","Agency/TT","Segment","Region","Indication","Vol Buys","Program","Old Bayer SKU ","Old Envu SKU","SKU","Product","Size","2025 In-Season Price","NOW Price","In SZN-NOW delta","Min Qty","Rebate $","Final Price","Extra Rebates- 14%","Lowest Price with 14% Tier Rebate","Total Savings with 14% Tier Rebate - GOLF","Extra Rebates- 12%","Lowest Price with 12% Tier Rebate","Total Savings with 12% Tier Rebate - LAWN/GSS","CA In-season Price","CA NOW Price","CA Final Price","WA In-season Price","WA NOW Price","WA Final Price","Package Ounces","Standard Use Rate (oz/M)","Standard Use Rate (oz/Acre)","Price/1000 sq ft","Price/Acre","Total %","*cumlative","Set"]
["Envu","A","G","NST","F","X","NOW",79895402,null,"D00000907","Banol®","2.5 gal ",1267,1267,0,null,null,1267,null,null,0.14000000000000001,null,null,0.12,1302.1600000000001,1302.1600000000001,1302.1600000000001,1275.8499999999999,1275.8499999999999,1275.8499999999999,320,2,87.12,7.9187500000000002,344.94075000000004,0,null,1]
["Envu","A","G","NST","F","X","NOW",79895402,null,"D00000907","Banol®","2.5 gal ",1267,1267,0,"2+",90,1177,null,null,0.21103393843725338,null,null,0.19103393843725336,1302.1600000000001,1302.1600000000001,1212.1600000000001,1275.8499999999999,1275.8499999999999,1185.8499999999999,320,2,87.12,7.3562500000000002,320.43825000000004,7.1033938437253363E-2,null,{"$f":"IF(PRICING[[#This Row],[SKU]]=J2,AL2+1,1)","v":2}]
["Envu","A","G","NST","F","X","NOW",null,null,"D00000623","Castlon™","1 gal",2748.2,2610.79,137.40999999999985,null,null,2610.79,null,null,0.18999999999999995,null,null,0.16999999999999993,"NA","NA","NA",2767.44,2629.07,2629.07,128,0.36,15.6816,7.3428468749999993,319.85440987499999,4.9999999999999933E-2,null,{"$f":"IF(PRICING[[#This Row],[SKU]]=J3,AL3+1,1)","v":1}]
["Envu","A","G","NST","F","X","NOW",null,null,"D00000623","Castlon™","1 gal",2748.2,2610.79,137.40999999999985,"5-9",525,2085.79,null,null,0.38103413143148235,null,null,0.36103413143148233,"NA","NA","NA",2767.44,2629.07,2104.0700000000002,128,0.36,15.6816,5.8662843749999993,255.53534737499999,0.24103413143148233,null,{"$f":"IF(PRICING[[#This Row],[SKU]]=J4,AL4+1,1)","v":2}]
["Envu","A","G","NST","F","X","NOW",null,null,"D00000623","Castlon™","1 gal",2748.2,2610.79,137.40999999999985,"10+",585,2025.79,null,null,0.40286660359508042,null,null,0.3828666035950804,"NA","NA","NA",2767.44,2629.07,2044.0700000000002,128,0.36,15.6816,5.697534375,248.18459737499998,0.26286660359508041,null,{"$f":"IF(PRICING[[#This Row],[SKU]]=J5,AL5+1,1)","v":3}]
["Envu","A","G","NST","F","X","EOP",null,null,"D00000624","Castlon™","16 oz",428,406.6,21.399999999999977,null,null,406.6,null,null,0.18999999999999995,null,null,0.16999999999999993,"NA","NA","NA",431,409.45,409.45,16,0.36,15.6816,9.1485000000000003,398.50866000000002,4.9999999999999933E-2,null,{"$f":"IF(PRICING[[#This Row],[SKU]]=J6,AL6+1,1)","v":1}]
["Envu","A","G","NST","F","X","EOP",null,null,"D00000624","Castlon™","16 oz",428,406.6,21.399999999999977,"4+",50,356.6,null,null,0.30682242990654207,null,null,0.28682242990654205,"NA","NA","NA",431,409.45,359.45,16,0.36,15.6816,8.0235000000000003,349.50366000000002,0.16682242990654206,null,{"$f":"IF(PRICING[[#This Row],[SKU]]=J7,AL7+1,1)","v":2}]
{"$rows_left_out":122}
{"sheet":"Sheet4","index":4,"n_rows":66,"n_cols":12,"rows_kept":66,"cut":false,"hidden":true,"merged":[]}
[]
[]
["SKU","Product","Program","Agency/TT","NOW Price"]
[427709,"Sencor 75","NOW","TT",710.1]
[3944704,"Forbid","NOW","TT",304.73999999999995,null,null,null,null,"D00000665","Acclaim Accelerate","0.5 gal"]
[11003880,"Rayora","NOW","A",631.4,null,null,null,null,"D00000666","Acclaim Accelerate","2.5 gal "]
[11008336,"Dismiss® Turf Herbicide","NOW","TT",363.59999999999997,null,null,null,null,"D00000907","Banol®","2.5 gal "]
[11008351,"Blindside® Herbicide ","NOW","TT",166.86,null,null,null,null,"D00000898","Armada 50 WDG","2 lb"]
{"$rows_left_out":58}